{"text_format":"1","workbook":"xlsx","n_sheets":10,"sheets":["Worksheet A","Calculator","Formula","Matrix","Child Care Adj","Child Care Matrix","Formula OTH","Sheet1","DocGen CSE819A","List of Counties"],"not_rendered":{"charts":0,"images":0,"macros":1,"external_links":1,"defined_names":6,"comments":0,"pivot_tables":0},"unopened":[],"bounds":{"document_bytes":16777216,"sheet_cells":100000,"rows_first":2000,"rows_last":500,"rows_between":2000,"halvings":0,"cell_chars":16384,"cell_head_chars":4096},"cells_cut":0,"cells_raw":0,"read":"whole","date_system":"1900"}

{"sheet":"Worksheet A","index":0,"n_rows":69,"n_cols":31,"rows_kept":69,"cut":false,"hidden":false,"merged":[[5,3,5,4],[3,1,4,2],[3,4,4,4],[2,10,3,10],[7,4,7,5],[2,5,3,9]]}
[]
[]
[null,null,null,null,null,"Worksheet A 2016"]
[null,"Number of Children"]
[null,null,null,null,null,{"$f":"+G5+I5","v":0},{"$f":"IF(G7=FALSE,0,1)","v":0},null,{"$f":"IF(I7=FALSE,0,1)","v":0}]
[null,null,null,"Parent with >272",null,null,"Mother",null,"Father",null,null,null,null,null,null,null,null,null,null,null,null,null,null,null," "]
[null,null,null,null,null,null,false,null,false]
[null,null,null,null,{"$f":"IF(F5>1,\"Only One Parent Can be Checked\",IF(F5=0,\"One Parent Must Be Checked\",\"\"))","v":"One Parent Must Be Checked"},null,null,null,null,null,null,null," ",null,null,null,null,null,null,null,null,null,null,null," "]
[null,null,null,null,null,null,null,null,null,null,null,null,null,null,null,null,null,null,null,null,null,null,null,null," "]
[null,null,1,null,"Monthly Gross Income",null,null,null,null,null,null,null,null,null,null,null,null,null,null,null,null,null,null,null," "]
[null,null,null," ",null,null,null,null,null,null,null,null,null,null,null,null,null,null,null,null,null,null,null,null," "]
[null,null,null,"a.","Plus Maintenance Received",null,null,null,null,null,null,null,null,null,null,null,null,null,null,null,null,null,null,null," "]
[]
[null,null,null,"b.","Minus Maintenance Paid"]
[null,null,null,null,null,null,null,null,null,null,null,null,null,null,null,null,null,null,null,null,null,null,null,null,null,null,null,null,"OTH"]
[null,null,null,"c.","Minus ordered CS Payments",null,null,null,null,null,null,null,null,null,null,null,null,null,null,null,null,null,null,"Mom","Dad",null,null,null,"Mom","Dad"]
[null,null,null,null,null,null,{"$f":"+G10+G12","v":0},null,{"$f":"+I10+I12","v":0},null,null,null,null,null,null,null,null,null,null,null,null,null,null,{"$f":"+G17","v":0},{"$f":"+I17","v":0},"Gross"]
[null,null,null,"d.","Minus legal responsibility",null,{"$f":"IF(F18<1,0,IF(G17<1100,X22,IF(G17<1900,X27,X20)))","v":0},null,{"$f":"IF(H18<1,0,IF(I17<1100,Y22,IF(I17<1900,Y27,Y20)))","v":0},null,null,null,null,null,null,null,null,null,null,null,null,null,null,{"$f":"+F18","v":0},{"$f":"+H18","v":0},"No of Kids"]
[null,null,null,null,null,null,null,null,null,null,null,null,null,null,null,null,null,null,null,null,null,null,null,{"$f":"+Formula!G19","v":{"$error":"#N/A"}},{"$f":"+Formula!H19","v":{"$error":"#N/A"}},"BSO","Hypo",null,{"$f":"+'Formula OTH'!G19","v":0},{"$f":"+'Formula OTH'!H19","v":0},"Hypo"]
[null,null,null,"e.","Resp for Children Outside the Home",null,null,null,null,null,null,null,null,null,null,null,null,null,null,null,null,null,null,{"$f":"ROUND(X19*0.75,2)","v":{"$error":"#N/A"}},{"$f":"ROUND(Y19*0.75,2)","v":{"$error":"#N/A"}},0.75,null,null,{"$f":"+G21","v":0},{"$f":"+I21","v":0},"Pay"]
[null,null,null,null,"          Amount Paid",null,null,null,null,null,null,null,null,null,null,null,null,null,null,null,null,null,null,{"$f":"IF(X18=1,50,IF(X18=2,70,IF(X18=3,90,IF(X18=4,110,IF(X18=5,130,IF(X18>5,150))))))","v":false},{"$f":"IF(Y18=1,50,IF(Y18=2,70,IF(Y18=3,90,IF(Y18=4,110,IF(Y18=5,130,IF(Y18>5,150))))))","v":false},"Min",null,null,{"$f":"IF(AC20<AC19,AC20,AC19)","v":0},{"$f":"IF(AD20<AD19,AD20,AD19)","v":0}]
[null,null,null,null,"          No of Children",null,null,null,null,null,null,null,null,null,null,null,null,null,null,null,null,null,null,{"$f":"+X21*0.75","v":0},{"$f":"+Y21*0.75","v":0},0.75]
[null,null,null,null,null,null,null,null,null,null,null,null,null,null,null,null,null,null,null,null,null,null,null,{"$f":"(X17-1100)","v":-1100},{"$f":"(Y17-1100)","v":-1100},"LIA Start"]
[null,null,null,null,"Minus Adjustment for Children OTH",null,{"$f":"IF(G22<1,0,AC21)","v":0},null,{"$f":"IF(I22<1,0,AD21)","v":0},null,null,null,null,null,null,null,null,null,null,null,null,null,null,{"$f":"IF(X18=1,50,IF(X18=2,70,IF(X18=3,90,IF(X18=4,110,IF(X18=5,130,IF(X18>5,150))))))","v":false},{"$f":"IF(Y18=1,50,IF(Y18=2,70,IF(Y18=3,90,IF(Y18=4,110,IF(Y18=5,130,IF(Y18>5,150))))))","v":false},"Per Kid"]
[null,null,null,null,null,null,null,null,null,null,null,null,null,null,null,null,null,null,null,null,null,null,null,{"$f":"+X23+X24","v":-1100},{"$f":"+Y23+Y24","v":-1100},"LIA"]
[null,null,null,"f.","Minus ordered educ cont",null,null,null,null,null,null,null,null,null,null,null,null,null,null,null,null,null,null,{"$f":"+X25*0.75","v":-825},{"$f":"+Y25*0.75","v":-825},0.75]
[null,null,null,null,null,null,null,null,null,null,null,null,null,null,null,null,null,null,null,null,null,null,null,{"$f":"IF(X26<X20,X26,X20)","v":{"$error":"#N/A"}},{"$f":"IF(Y26<Y20,Y26,Y20)","v":{"$error":"#N/A"}},"lower of LIA or Hypothetical Order"]
[null,null,2,null,"Monthly Adj Gross Income",null,{"$f":"IF(G10+G12-G14-G16-G18-G24-G26<0,0,G10+G12-G14-G16-G18-G24-G26)","v":0},null,{"$f":"IF(I10+I12-I14-I16-I18-I24-I26<0,0,I10+I12-I14-I16-I18-I24-I26)","v":0},null,{"$f":"+G28+I28","v":0}]
[null,null,null,null,null,null,null,null,null,null,null,null,null,null,null,null,null,null,null,null,null,null,">1100","Mom","Dad"]
[null,null,3,null,"% Share of Income",null,{"$f":"ROUND(G28/K28,4)","v":{"$error":"#DIV/0!"}},null,{"$f":"ROUND(I28/K28,4)","v":{"$error":"#DIV/0!"}},null,null,null,null,null,null,null,null,null,null,null,null,null,{"$f":"IF(K28>1100,1,0)","v":0},{"$f":"IF(G5=1,0,1)","v":1},{"$f":"IF(I5=1,0,1)","v":1},null,"1 is NCP"]
{"$rows_left_out":40}
{"sheet":"Calculator","index":1,"n_rows":9,"n_cols":9,"rows_kept":9,"cut":false,"hidden":true,"merged":[]}
[]
[]
[null,"Number of Children",{"$f":"+'Worksheet A'!E4","v":0},null,null,2953,"low",{"$f":"+F4-F3","v":3},"diff"]
[null,null," ",null,null,2956,"high"]
[null,"Actual CGI",{"$f":"+'Worksheet A'!K28","v":0}]
[null,null,null,null,null,37,"amt over"]
[null,null,null,null,null,{"$f":"+H3/50*F6","v":2.2199999999999998},"inc"]
[null,null,null,null,null,null," "," "]
[null,"Basic Support Obligation",{"$f":"+Formula!C18","v":0},null,null,{"$f":"+F7+F3","v":2955.22},"Total"]

{"sheet":"Formula","index":2,"n_rows":22,"n_cols":15,"rows_kept":22,"cut":false,"hidden":true,"merged":[]}
[null,"Kids",{"$f":"+Calculator!C3","v":0},null,{"$f":"IF(C1=0,0,IF(C1=1,1,IF(C1=2,2,IF(C1=3,3,IF(C1=4,4,IF(C1=5,5,6))))))","v":0},null,{"$f":"IF(E1=0,0,IF(E1=1,50,IF(E1=2,70,IF(E1=3,90,IF(E1=4,110,IF(E1=5,130,IF(E1=6,150,0)))))))","v":0}]
[]
[null,null,null,null,null,null,null,"Legal Respnsibility"]
[null,"Kids",{"$f":"+Calculator!C3","v":0},null,{"$f":"IF(C4=0,0,IF(C4=1,2,IF(C4=2,3,IF(C4=3,4,IF(C4=4,5,IF(C4=5,6,IF(C4>5,7)))))))","v":0},null,{"$f":"+'Worksheet A'!X18","v":0},{"$f":"+'Worksheet A'!Y18","v":0},null,null,null,null,1053,null,"Low"]
[null,null,null,null,null,null,{"$f":"IF(G4=0,0,IF(G4=1,2,IF(G4=2,3,IF(G4=3,4,IF(G4=4,5,IF(G4=5,6,IF(G4>5,7)))))))","v":0},{"$f":"IF(H4=0,0,IF(H4=1,2,IF(H4=2,3,IF(H4=3,4,IF(H4=4,5,IF(H4=5,6,IF(H4>5,7)))))))","v":0},null,null,null,null,1063,null,"High"]
[null,"CGI",{"$f":"+Calculator!C5","v":0},null,{"$f":"VLOOKUP(C6,Matrix!A:G,Formula!E4)","v":{"$error":"#N/A"}},null,null,null,null,null,null,null,{"$f":"+M5-M4","v":10},null,"Diff High and Low"]
[null,null,null,null,null,null,"Mom","Dad",null,null,null,null,50,null,"Spread"]
[null,null,{"$f":"ROUNDUP(C6/50,0)*50","v":0},null,{"$f":"VLOOKUP(C8,Matrix!A:G,Formula!E4)","v":{"$error":"#N/A"}},null,{"$f":"+'Worksheet A'!G17","v":0},{"$f":"'Worksheet A'!I17","v":0},null,"Gross",null,null,10,null,"Amount Over"]
[]
[null,"Diff",{"$f":"+E8-E6","v":{"$error":"#N/A"}},null,null,null,{"$f":"ROUNDUP(G8/50,0)*50","v":0},{"$f":"ROUNDUP(H8/50,0)*50","v":0},null,null,null,null,{"$f":"+M6/M7*M8","v":2},null,"Inc"]
[]
[null,"Spread",50,null,null,null,{"$f":"VLOOKUP(G8,Matrix!A:G,Formula!G5)","v":{"$error":"#N/A"}},{"$f":"VLOOKUP(H8,Matrix!A:G,Formula!H5)","v":{"$error":"#N/A"}},null,"Low"]
[null,null,null,null,null,null,{"$f":"VLOOKUP(G10,Matrix!A:G,Formula!G5)","v":{"$error":"#N/A"}},{"$f":"VLOOKUP(H10,Matrix!A:G,Formula!H5)","v":{"$error":"#N/A"}},null,"High",null,null,{"$f":"+M4+M10","v":1055},null,"Total"]
[null,"Amt Over",{"$f":"+C6-(C8-50)","v":50},null,null,null,{"$f":"+G13-G12","v":{"$error":"#N/A"}},{"$f":"+H13-H12","v":{"$error":"#N/A"}},null,"Diff"]
[null,null,null,null,null,null,50,50,null,"Spread"]
[null,"Inc BSO",{"$f":"ROUND(C10/C12*C14,2)","v":{"$error":"#N/A"}},"rounded",null,null,{"$f":"+G8-(G10-50)","v":50},{"$f":"+H8-(H10-50)","v":50},null,"Amt Over"]
[null,null,null,null,null,null,{"$f":"+G14/G15*G16","v":{"$error":"#N/A"}},{"$f":"+H14/H15*H16","v":{"$error":"#N/A"}},null,"Inc BSO"]
[null,"BSO",{"$f":"IF(Calculator!C5=0,0,IF(Calculator!C5<1100,G1,Formula!C22))","v":0}]
[null,null,null,null,null,null,{"$f":"+G12+G17","v":{"$error":"#N/A"}},{"$f":"+H12+H17","v":{"$error":"#N/A"}},null,"BSO"]
[null,"Low",50]
[null,"High"]
[null,"Actual",{"$f":"+E6+C16","v":{"$error":"#N/A"}}]

{"sheet":"Matrix","index":3,"n_rows":580,"n_cols":7,"rows_kept":580,"cut":false,"hidden":true,"merged":[]}
["CombGross","One","Two","Three","Four","Five","SixMore"]
[1100,216,335,410,458,504,547]
[1150,225,348,427,477,524,570]
[1200,234,362,443,495,545,592]
[1250,243,375,460,513,565,614]
[1300,251,389,476,532,585,636]
[1350,260,402,492,550,605,658]
[1400,269,416,509,568,625,680]
[1450,277,429,525,587,645,701]
[1500,286,442,541,604,665,723]
[1550,294,455,556,622,684,743]
[1600,302,467,572,639,703,764]
[1650,310,480,587,656,721,784]
[1700,319,492,602,673,740,805]
[1750,327,505,618,690,759,825]
[1800,335,518,634,708,778,846]
[1850,343,530,649,725,798,867]
[1900,352,543,665,742,817,888]
[1950,360,556,680,760,836,908]
[2000,368,569,696,777,855,929]
[2050,377,581,711,794,874,950]
[2100,385,594,727,812,893,971]
[2150,393,607,742,829,912,991]
[2200,401,620,758,847,931,1012]
[2250,410,632,773,864,950,1033]
[2300,418,645,789,881,969,1054]
[2350,426,658,804,899,988,1074]
[2400,435,671,820,916,1007,1095]
[2450,443,683,835,933,1026,1116]
[2500,451,696,851,950,1045,1136]
{"$rows_left_out":551}
{"sheet":"Child Care Adj","index":4,"n_rows":30,"n_cols":12,"rows_kept":30,"cut":false,"hidden":true,"merged":[]}
["Line"]
[]
[null,null,"Mother","Father"]
[]
[2,"# of Kids",{"$f":"+'Worksheet A'!F40","v":0},{"$f":"+'Worksheet A'!H40","v":0}]
[]
[3,"Expenses",{"$f":"+'Worksheet A'!G40","v":0},{"$f":"+'Worksheet A'!I40","v":0}]
[null,"Annual",{"$f":"+C7*12","v":0},{"$f":"+D7*12","v":0}]
[null,null,{"$f":"IF(C5=0,0,IF(C5=1,3000,6000))","v":0},{"$f":"IF(D5=0,0,IF(D5=1,3000,6000))","v":0}]
[null,null,{"$f":"IF(C8>C9,C9,C8)","v":0},{"$f":"IF(D8>D9,D9,D8)","v":0}]
[]
[4,"Earned Income",{"$f":"+'Worksheet A'!G10+'Worksheet A'!G12","v":0},{"$f":"+'Worksheet A'!I10+'Worksheet A'!I12","v":0}]
[null,"Annual",{"$f":"+C12*12","v":0},{"$f":"+D12*12","v":0}]
[null,null,null,null,null,null,null,null,null,1000,0.25,{"$f":"+J14*K14","v":250}]
[5,"n/a"]
[]
[6,"Smallest 3,4",{"$f":"IF(C10<C13,C10,C13)","v":0},{"$f":"IF(D10<D13,D10,D13)","v":0}]
[]
[]
[7,"n/a"]
[]
[8,"Decimal",{"$f":"VLOOKUP(C13,'Child Care Matrix'!A:B,2)","v":0.35},{"$f":"VLOOKUP(D13,'Child Care Matrix'!A:B,2)","v":0.35},null,null," ",{"$f":"200*0.35","v":70}]
[]
[9,null,{"$f":"+C17/12*C22","v":0},{"$f":"+D17/12*D22","v":0},null,null,null,{"$f":"+C17*0.2","v":0}]
[]
[10,"n/a"]
[]
[11,null,{"$f":"+C24","v":0},{"$f":"+D24","v":0}]
[]
[null,"Federal Tax Cr",{"$f":"+C7-C28","v":0},{"$f":"+D7-D28","v":0}]
{"$rows_left_out":1}
{"sheet":"Child Care Matrix","index":5,"n_rows":16,"n_cols":2,"rows_kept":16,"cut":false,"hidden":true,"merged":[]}
[0,0.35]
[15000.01,0.34]
[17000.009999999998,0.33]
[19000.009999999998,0.32]
[21000.01,0.31]
[23000.01,0.3]
[25000.01,0.28999999999999998]
[27000.01,0.28000000000000003]
[29000.01,0.27]
[31000.01,0.26]
[33000.01,0.25]
[35000.01,0.24]
[37000.01,0.23]
[39000.01,0.22]
[41000.01,0.21]
[43000.01,0.2]

{"sheet":"Formula OTH","index":6,"n_rows":22,"n_cols":15,"rows_kept":22,"cut":false,"hidden":true,"merged":[]}
[null,"Kids",{"$f":"+Calculator!C3","v":0},null,{"$f":"IF(C1=0,0,IF(C1=1,1,IF(C1=2,2,IF(C1=3,3,IF(C1=4,4,IF(C1=5,5,6))))))","v":0},null,{"$f":"IF(E1=0,0,IF(E1=1,50,IF(E1=2,70,IF(E1=3,90,IF(E1=4,110,IF(E1=5,130,IF(E1=6,150,0)))))))","v":0}]
[]
[null,null,null,null,null,null,null,"Outside The Home"]
[null,"Kids",{"$f":"+Calculator!C3","v":0},null,{"$f":"IF(C4=0,0,IF(C4=1,2,IF(C4=2,3,IF(C4=3,4,IF(C4=4,5,IF(C4=5,6,IF(C4>5,7)))))))","v":0},null,{"$f":"+'Worksheet A'!G22","v":0},{"$f":"+'Worksheet A'!I22","v":0},null,null,null,null,1053,null,"Low"]
[null,null,null,null,null,null,{"$f":"IF(G4=0,0,IF(G4=1,2,IF(G4=2,3,IF(G4=3,4,IF(G4=4,5,IF(G4=5,6,IF(G4>5,7)))))))","v":0},{"$f":"IF(H4=0,0,IF(H4=1,2,IF(H4=2,3,IF(H4=3,4,IF(H4=4,5,IF(H4=5,6,IF(H4>5,7)))))))","v":0},null,null,null,null,1063,null,"High"]
[null,"CGI",{"$f":"ROUNDDOWN(+Calculator!C5,0)","v":0},null,{"$f":"VLOOKUP(C6,Matrix!A:G,'Formula OTH'!E4)","v":{"$error":"#N/A"}},null,null,null,null,null,null,null,{"$f":"+M5-M4","v":10},null,"Diff High and Low"]
[null,null,null,null,null,null,"Mom","Dad",null,null,null,null,50,null,"Spread"]
[null,null,{"$f":"ROUNDUP(C6/50,0)*50","v":0},null,{"$f":"VLOOKUP(C8,Matrix!A:G,'Formula OTH'!E4)","v":{"$error":"#N/A"}},null,{"$f":"ROUNDDOWN(+'Worksheet A'!G17,0)","v":0},{"$f":"ROUNDDOWN(+'Worksheet A'!I17,0)","v":0},null,"Gross",null,null,10,null,"Amount Over"]
[]
[null,"Diff",{"$f":"+E8-E6","v":{"$error":"#N/A"}},null,null,null,{"$f":"ROUNDUP(G8/50,0)*50","v":0},{"$f":"ROUNDUP(H8/50,0)*50","v":0},null,null,null,null,{"$f":"+M6/M7*M8","v":2},null,"Inc"]
[]
[null,"Spread",50,null,null,null,{"$f":"IF(G8<1100,G6,VLOOKUP(G8,Matrix!A:G,Formula!G5))","v":0},{"$f":"IF(H8<1100,H6,VLOOKUP(H8,Matrix!A:G,H5))","v":0},null,"Low"]
[null,null,null,null,null,null,{"$f":"IF(G10<1100,G6,VLOOKUP(G10,Matrix!A:G,Formula!G5))","v":0},{"$f":"IF(H10<1100,H6,VLOOKUP(H10,Matrix!A:G,H5))","v":0},null,"High",null,null,{"$f":"+M4+M10","v":1055},null,"Total"]
[null,"Amt Over",{"$f":"+C6-(C8-50)","v":50},null,null,null,{"$f":"+G13-G12","v":0},{"$f":"+H13-H12","v":0},null,"Diff"]
[null,null,null,null,null,null,50,50,null,"Spread"]
[null,"Inc BSO",{"$f":"ROUND(C10/C12*C14,2)","v":{"$error":"#N/A"}},"rounded",null,null,{"$f":"+G8-(G10-50)","v":50},{"$f":"+H8-(H10-50)","v":50},null,"Amt Over"]
[null,null,null,null,null,null,{"$f":"+G14/G15*G16","v":0},{"$f":"+H14/H15*H16","v":0},null,"Inc BSO"]
[null,"BSO",{"$f":"IF(Calculator!C5=0,0,IF(Calculator!C5<1100,G1,'Formula OTH'!C22))","v":0}]
[null,null,null,null,null,null,{"$f":"+G12+G17","v":0},{"$f":"+H12+H17","v":0},null,"BSO"]
[null,"Low",50]
[null,"High"]
[null,"Actual",{"$f":"+E6+C16","v":{"$error":"#N/A"}}]

{"sheet":"Sheet1","index":7,"n_rows":17,"n_cols":9,"rows_kept":17,"cut":false,"hidden":true,"merged":[]}
[]
[]
[]
[null,2953,"Actual"]
[null,2950,"Schedule",533,540,{"$f":"+E5-D5","v":7},null,50,{"$f":"+F5/H5","v":0.14000000000000001}]
[null,{"$f":"+B4-B5","v":3},"Excess"]
[null,{"$f":"+I5*B6","v":0.42000000000000004},"Amount for Excess"]
[]
[null,{"$f":"+D5+B7","v":533.41999999999996},"Final Amount"]
[]
[]
[null,2953,"Actual"]
[null,2950,"Schedule",533,540,{"$f":"+E13-D13","v":7},null,50,{"$f":"+F13/H13","v":0.14000000000000001}]
[null,{"$f":"+B12-B13","v":3},"Excess"]
[null,{"$f":"+I13*B14","v":0.42000000000000004},"Amount for Excess"]
[]
[null,{"$f":"+D13+B15","v":533.41999999999996},"Final Amount"]

{"sheet":"DocGen CSE819A","index":8,"n_rows":91,"n_cols":17,"rows_kept":91,"cut":false,"hidden":false,"merged":[[1,1,1,2],[1,3,1,6],[1,9,1,14],[2,2,2,3],[2,4,2,6],[2,7,2,8],[2,12,2,14],[7,1,7,4],[7,5,7,6],[7,7,7,12],[7,13,7,14],[8,1,8,4],[8,5,8,6],[8,7,8,12],[8,13,8,14],[3,1,3,14],[4,1,4,4],[4,7,4,14],[5,7,5,8],[6,1,6,4],[6,5,6,6],[6,7,6,12],[6,13,6,14],[11,1,11,6],[11,7,11,9],[11,10,11,12],[11,13,11,14],[12,1,12,6],[12,7,12,9],[12,10,12,12],[12,13,12,14],[9,1,9,4],[9,5,9,6],[9,7,9,12],[9,13,9,14],[10,1,10,6],[10,7,10,8],[10,10,10,11],[10,13,10,14],[15,1,15,6],[15,7,15,9],[15,10,15,12],[15,13,15,14],[16,1,16,6],[16,7,16,9],[16,10,16,12],[16,13,16,14],[13,1,13,6],[13,7,13,9],[13,10,13,12],[13,13,13,14],[14,1,14,6],[14,7,14,9],[14,10,14,12],[14,13,14,14],[19,1,19,6],[19,7,19,9],[19,10,19,12],[19,13,19,14],[20,1,20,6],[20,7,20,12],[20,13,20,14],[17,1,17,6],[17,7,17,9],[17,10,17,12],[17,13,17,14],[18,1,18,6],[18,7,18,9],[18,10,18,12],[18,13,18,14],[23,1,23,6],[23,7,23,14],[24,1,24,6],[24,7,24,9],[24,10,24,12],[24,13,24,14],[21,1,21,6],[21,7,21,9],[21,10,21,12],[21,13,21,14],[22,1,22,6],[22,7,22,9],[22,10,22,12],[22,13,22,14],[27,1,27,6],[27,7,27,9],[27,10,27,12],[27,13,27,14],[28,1,28,6],[28,7,28,9],[28,10,28,12],[28,13,28,14],[25,1,25,6],[25,7,25,9],[25,10,25,12],[25,13,25,14],[26,1,26,6],[26,7,26,9],[26,10,26,12],[26,13,26,14],[31,1,31,6],[31,7,31,9],[31,10,31,12],[31,13,31,14],[32,1,32,6],[32,7,32,9],[32,10,32,12],[32,13,32,14],[29,1,29,6],[29,7,29,9],[29,10,29,12],[29,13,29,14],[30,1,30,6],[30,7,30,9],[30,10,30,12],[30,13,30,14],[36,1,36,6],[39,1,39,14],[40,1,49,14],[50,1,50,14],[51,1,51,14],[52,1,52,14],[33,1,33,6],[33,7,33,9],[33,10,33,12],[33,13,33,14],[34,1,34,6],[34,7,34,9],[34,10,34,12],[34,13,34,14],[83,6,83,7],[83,9,83,11],[83,13,83,14],[67,1,67,14],[68,1,68,14],[53,1,53,2],[53,3,53,11],[53,13,53,14],[55,1,55,4],[56,1,56,14],[58,1,58,14],[63,1,63,14],[64,1,64,14],[72,1,72,8],[70,9,70,11],[71,9,71,11],[72,9,72,11],[74,6,74,8],[74,9,74,11],[69,1,69,5],[88,3,88,4],[88,6,88,7],[88,9,88,11],[88,13,88,14],[90,1,90,6],[59,1,59,14],[60,1,60,14],[61,1,61,14],[62,1,62,14],[84,3,84,4],[84,6,84,7],[84,9,84,11],[84,13,84,14],[87,3,87,4],[87,6,87,7],[87,9,87,11],[87,13,87,14],[73,1,73,14],[76,1,76,14],[78,1,78,14],[79,1,80,14],[83,3,83,4],[70,1,70,8],[71,6,71,8]]}
[]
[null,"DISTRICT COURT , ",null,null,null,null,null,null,null,"IV-D CASE"]
[null,"CASE NO.",null,null,"COURT ROOM/DIVISION"]
[null,"WORKSHEET A - CHILD SUPPORT OBLIGATION:  SOLE PHYSICAL CARE"]
[null,null,null,null,null,null,null,null,null,null,null,null,null,null,null,null,"* Rows 11- 35 will not be cleared using this button,"]
[null,"Obligee",null,null,null,null,null,"Obligor",null,null,null,null,null,null,null,null,"    Rows 11- 35 will clear only when using the \"Get New /Blank Form\" on \"Worksheet A\" tab"]
[null,"Children",null,null,null,"Date of Birth",null,"Children",null,null,null,null,null,"Date of Birth"]
[]
[]
[]
[null,"OVERNIGHTS WITH EACH PARENT (MUST TOTAL 365)",null,null,null,null,null,"MOTHER:",null,{"$f":"IF('Worksheet A'!G5=1,365,0)","v":0},"FATHER :",null,{"$f":"IF('Worksheet A'!I5=1,365,0)","v":0},"COMBINED"]
[null,"1. MONTHLY GROSS INCOME",null,null,null,null,null,{"$f":"'Worksheet A'!G10","v":0},null,null,{"$f":"'Worksheet A'!I10","v":0}]
[null,"a. Plus maintenance received",null,null,null,null,null,{"$f":"'Worksheet A'!G12","v":0},null,null,{"$f":"'Worksheet A'!I12","v":0}]
[null,"b. Minus maintenance paid",null,null,null,null,null,{"$f":"'Worksheet A'!G14","v":0},null,null,{"$f":"'Worksheet A'!I14","v":0}]
[null,"c. Ordered child support payments for other children §14-10-15(6)(a)(I),C.R.S",null,null,null,null,null,{"$f":"'Worksheet A'!G16","v":0},null,null,{"$f":"'Worksheet A'!I16","v":0}]
[null,"d. Legal responsibility for children not of this marriage/relationship §14-10-115(6)(a)(II), C.R.S. (0/0)",null,null,null,null,null,{"$f":"'Worksheet A'!G18","v":0},null,null,{"$f":"'Worksheet A'!I18","v":0}]
[null,"e. Minus paid for other children without order §14-10-15(6)(a)(III),C.R.S (/)",null,null,null,null,null,{"$f":"'Worksheet A'!G24","v":0},null,null,{"$f":"'Worksheet A'!I24","v":0}]
[null,"f. Subtract ordered post-secondary education contributions**",null,null,null,null,null,{"$f":"'Worksheet A'!G26","v":0},null,null,{"$f":"'Worksheet A'!I26","v":0}]
[null,"2. MONTHLY ADJUSTED GROSS INCOME (If either the paying parent's Income or Combined Income is less than 1,100, see the Minimum Order Worksheet on page 2 and enter that amount on line 11 for the paying parent)",null,null,null,null,null,{"$f":"'Worksheet A'!G28","v":0},null,null,{"$f":"'Worksheet A'!I28","v":0},null,null,{"$f":"'Worksheet A'!K28","v":0}]
[null,"3. EACH PARENT'S PERCENTAGE SHARE OF INCOME (Each parent's income from line 2 divided by Combined Income)",null,null,null,null,null,{"$f":"'Worksheet A'!G30","v":{"$error":"#DIV/0!"}},null,null,{"$f":"'Worksheet A'!I30","v":{"$error":"#DIV/0!"}}]
[null,"4a. BASIC CHILD SUPPORTOBLIGATION (Apply line 2 Combined column to Child Support Schedule",null,null,null,null,null,null,null,null,null,null,null,{"$f":"'Worksheet A'!K32","v":0}]
[null,"  b. Each parent's share of support obligation (Each parent's percentage from line 3 times Combined obligation in 4a)",null,null,null,null,null,{"$f":"'Worksheet A'!G34","v":{"$error":"#DIV/0!"}},null,null,{"$f":"'Worksheet A'!I34","v":{"$error":"#DIV/0!"}}]
[null,"5. LOW-INCOME ADJUSTMENT(If paying parent's income in line 2 is less than $1,900, see the Low-income Worksheet on page 2 and enter that amount)",null,null,null,null,null,{"$f":"'Worksheet A'!G36","v":{"$error":"#VALUE!"}},null,null,{"$f":"'Worksheet A'!I36","v":{"$error":"#VALUE!"}}]
[null,"6. ADJUSTMENTS (Expenses paid directly by each parent)"]
[null,"a. Work-related Child Care- Actual costs minus Federal Tax Credit pursuant to §14-10-115(9), C.R.S (0.00/0.00)",null,null,null,null,null,{"$f":"'Worksheet A'!G42","v":0},null,null,{"$f":"'Worksheet A'!I42","v":0}]
[null,"b. Education-related Child Care pursuant to §14-10-115(9), C.R.S.",null,null,null,null,null,{"$f":"'Worksheet A'!G44","v":0},null,null,{"$f":"'Worksheet A'!I44","v":0}]
[null,"c. Health Insurance premium costs-  Children's portion only pursuant to §14-10-115(10), C.R.S (See Page 2 for calculation worksheet)",null,null,null,null,null,{"$f":"'Worksheet A'!G46","v":0},null,null,{"$f":"'Worksheet A'!I46","v":0}]
[null,"d. Extraordinary Medical Expenses Unisured Only pursuant to §14-10-115(10), C.R.S",null,null,null,null,null,{"$f":"'Worksheet A'!G48","v":0},null,null,{"$f":"'Worksheet A'!I48","v":0}]
[null,"e. Extraordinary Expenses Agreed to by parents or by order of the court pursuant §14-10-115(11)(a), C.R.S",null,null,null,null,null,{"$f":"'Worksheet A'!G50","v":0},null,null,{"$f":"'Worksheet A'!I50","v":0}]
[null,"f. Extraordinary Adjustments pursuant to §14-10-115(11)(b), C.R.S",null,null,null,null,null,{"$f":"'Worksheet A'!G52","v":0},null,null,{"$f":"'Worksheet A'!I56","v":{"$error":"#DIV/0!"}}]
{"$rows_left_out":62}
{"sheet":"List of Counties","index":9,"n_rows":64,"n_cols":1,"rows_kept":64,"cut":false,"hidden":true,"merged":[]}
[]
["ADAMS COUNTY, COLORADO"]
["ALAMOSA COUNTY, COLORADO"]
["ARAPAHOE COUNTY, COLORADO"]
["ARCHULETA COUNTY, COLORADO"]
["BACA COUNTY, COLORADO"]
["BENT COUNTY, COLORADO"]
["BOULDER COUNTY, COLORADO"]
["BROOMFIELD COUNTY, COLORADO"]
["CHAFFEE COUNTY, COLORADO"]
["CHEYENNE COUNTY, COLORADO"]
["CLEAR CREEK COUNTY, COLORADO"]
["CONEJOS COUNTY, COLORADO"]
["COSTILLA COUNTY, COLORADO"]
["CROWLEY COUNTY, COLORADO"]
["CUSTER COUNTY, COLORADO"]
["DELTA COUNTY, COLORADO"]
["DENVER COUNTY, COLORADO"]
["DOLORES COUNTY, COLORADO"]
["DOUGLAS COUNTY, COLORADO"]
["EAGLE COUNTY, COLORADO"]
["ELBERT COUNTY, COLORADO"]
["EL PASO COUNTY, COLORADO"]
["FREMONT COUNTY, COLORADO"]
["GARFIELD COUNTY, COLORADO"]
["GILPIN COUNTY, COLORADO"]
["GRAND COUNTY, COLORADO"]
["GUNNISON COUNTY, COLORADO"]
["HINSDALE COUNTY, COLORADO"]
["HUERFANO COUNTY, COLORADO"]
{"$rows_left_out":34}